Reaction Details
TargetcAMP and cAMP-inhibited cGMP 3',5'-cyclic phosphodiesterase 10A
LigandBDBM194387
Substrate/Competitorn/a
Meas. Tech.Homogenous Time-Resolved Fluorescence Resonance Energy Transfer (TR-FRET) Technology
IC50 5.20±n/a nM
Citation Leblond, BTaverne, TChauvignac, CBeausoleil, ECasagrande, ADesire, LPando, MPDonello, JEYang, R Substituted 6, 7-dialkoxy-3-isoquinoline derivatives as inhibitors of phosphodiesterase 10 (PDE 10A) US Patent US9902710 Publication Date 2/27/2018
 
cAMP and cAMP-inhibited cGMP 3',5'-cyclic phosphodiesterase 10A
Name:cAMP and cAMP-inhibited cGMP 3',5'-cyclic phosphodiesterase 10A
Type:Protein
Mol. Mass.:88412.52
Organism:Homo sapiens (Human)
Description:Q9Y233
Residue:1055
BDBM194387
NameBDBM194387
Synonyms:US9200016, 69 | US9902710, Compound 69
TypeSmall organic molecule
Emp. Form.C25H26N2O2
Mol. Mass.386.4861
SMILESCCCc1ncc(Cc2cnc3cc(C)ccc3c2)c2cc(OC)c(OC)cc12