Reaction Details
TargetcAMP and cAMP-inhibited cGMP 3',5'-cyclic phosphodiesterase 10A
LigandBDBM194402
Substrate/Competitorn/a
Meas. Tech.Homogenous Time-Resolved Fluorescence Resonance Energy Transfer (TR-FRET) Technology
IC50 0.530±n/a nM
Citation Leblond, BTaverne, TChauvignac, CBeausoleil, ECasagrande, ADesire, LPando, MPDonello, JEYang, R Substituted 6, 7-dialkoxy-3-isoquinoline derivatives as inhibitors of phosphodiesterase 10 (PDE 10A) US Patent US9902710 Publication Date 2/27/2018
 
cAMP and cAMP-inhibited cGMP 3',5'-cyclic phosphodiesterase 10A
Name:cAMP and cAMP-inhibited cGMP 3',5'-cyclic phosphodiesterase 10A
Type:Protein
Mol. Mass.:88412.52
Organism:Homo sapiens (Human)
Description:Q9Y233
Residue:1055
BDBM194402
NameBDBM194402
Synonyms:US9200016, 84 | US9902710, Compound 84
TypeSmall organic molecule
Emp. Form.C23H24N4O4S
Mol. Mass.452.526
SMILESCCc1ncc(Cc2ccc3cccc(NS(N)(=O)=O)c3n2)c2cc(OC)c(OC)cc12