Reaction Details
TargetcAMP and cAMP-inhibited cGMP 3',5'-cyclic phosphodiesterase 10A
LigandBDBM194423
Substrate/Competitorn/a
Meas. Tech.Homogenous Time-Resolved Fluorescence Resonance Energy Transfer (TR-FRET) Technology
IC50 4.30±n/a nM
Citation Leblond, BTaverne, TChauvignac, CBeausoleil, ECasagrande, ADesire, LPando, MPDonello, JEYang, R Substituted 6, 7-dialkoxy-3-isoquinoline derivatives as inhibitors of phosphodiesterase 10 (PDE 10A) US Patent US9902710 Publication Date 2/27/2018
 
cAMP and cAMP-inhibited cGMP 3',5'-cyclic phosphodiesterase 10A
Name:cAMP and cAMP-inhibited cGMP 3',5'-cyclic phosphodiesterase 10A
Type:Protein
Mol. Mass.:88412.52
Organism:Homo sapiens (Human)
Description:Q9Y233
Residue:1055
BDBM194423
NameBDBM194423
Synonyms:US9200016, 105 | US9902710, Compound 105
TypeSmall organic molecule
Emp. Form.C23H22N2O2
Mol. Mass.358.433
SMILESCOc1cc2c(C)ncc(Cc3ccc4nc(C)ccc4c3)c2cc1OC