Reaction Details
TargetLiver carboxylesterase 1
LigandBDBM22859
Substrate/CompetitorBDBM22723
Meas. Tech.Enzyme Inhibition Assay
Ki 1.5±n/a nM
Citation Hyatt, JLWadkins, RMTsurkan, LHicks, LDHatfield, MJEdwards, CCRoss, CRCantalupo, SACrundwell, GDanks, MKGuy, RKPotter, PM Planarity and constraint of the carbonyl groups in 1,2-diones are determinants for selective inhibition of human carboxylesterase 1. J Med Chem50:5727-34 (2007) 
 
Liver carboxylesterase 1
Name:Liver carboxylesterase 1
Type:Protein
Mol. Mass.:62520.83
Organism:Homo sapiens (Human)
Description:n/a
Residue:567
BDBM22859
BDBM22723
NameBDBM22859
Synonyms:1,2-Dione-Based Compound, 16 | 1,2-dihydroaceanthrylene-1,2-dione
TypeSmall organic molecule
Emp. Form.C16H8O2
Mol. Mass.232.2335
SMILESO=c1c2cccc3cc4ccccc4c(c23)c1=O