Reaction Details
TargetHistamine H4 receptor
LigandBDBM22908
Substrate/CompetitorBDBM7966
Meas. Tech.H4R Radioligand Binding Assay
Ki 251±n/a nM
Citation Lim, HDvan Rijn, RMLing, PBakker, RAThurmond, RLLeurs, R Evaluation of histamine H1-, H2-, and H3-receptor ligands at the human histamine H4 receptor: identification of 4-methylhistamine as the first potent and selective H4 receptor agonist. J Pharmacol Exp Ther314:1310-21 (2005) 
 
Histamine H4 receptor
Name:Histamine H4 receptor
Type:G Protein-Coupled Receptor (GPCR)
Mol. Mass.:44517.02
Organism:Homo sapiens (Human)
Description:Binding assays were using CHO cells stably expressing hH4R receptors.
Residue:390
BDBM22908
BDBM7966
NameBDBM22908
Synonyms:4( 5)-( 5-aminopenty1)-lH-imidazole Impentamine
TypeSmall organic molecule
Emp. Form.C8H15N3
Mol. Mass.153.2248
SMILESNCCCCCc1cnc[nH]1