Reaction Details
TargetHistamine H3 receptor
LigandBDBM22910
Substrate/CompetitorBDBM22530
Meas. Tech.H3R Radioligand Binding Assay
Ki 0.794±n/a nM
Citation Lim, HDvan Rijn, RMLing, PBakker, RAThurmond, RLLeurs, R Evaluation of histamine H1-, H2-, and H3-receptor ligands at the human histamine H4 receptor: identification of 4-methylhistamine as the first potent and selective H4 receptor agonist. J Pharmacol Exp Ther314:1310-21 (2005) 
 
Histamine H3 receptor
Name:Histamine H3 receptor
Type:G Protein-Coupled Receptor (GPCR)
Mol. Mass.:48691.47
Organism:Homo sapiens (Human)
Description:Binding assays were using CHO cells stably expressing hH3R receptors.
Residue:445
BDBM22910
BDBM22530
NameBDBM22910
Synonyms:4-(1H-imidazol-5-ylmethyl)pyridine | Immethridine
TypeSmall organic molecule
Emp. Form.C9H9N3
Mol. Mass.159.1879
SMILESC(c1cnc[nH]1)c1ccncc1