Reaction Details
TargetAdenosine deaminase
LigandBDBM22921
Substrate/CompetitorBDBM14487
Meas. Tech.ADA Inhibition Assay
pH7.4±n/a
Temperature295.15±n/a K
Ki 54000±n/a nM
Citation Terasaka, TNakanishi, INakamura, KEikyu, YKinoshita, TNishio, NSato, AKuno, MSeki, NSakane, K Structure-based de novo design of non-nucleoside adenosine deaminase inhibitors. Bioorg Med Chem Lett13:1115-8 (2003) 
 
Adenosine deaminase
Name:Adenosine deaminase
Type:Enzyme
Mol. Mass.:40759.44
Organism:Homo sapiens (Human)
Description:Human recombinant ADA was expressed and purified from an ADA-deficient bacterial strain.
Residue:363
BDBM22921
BDBM14487
NameBDBM22921
Synonyms:1-(2-hydroxy-1-phenylethyl)-1H-imidazole-4-carboxamide | imidazole-4-carboxamide compound, 3
TypeSmall organic molecule
Emp. Form.C12H13N3O2
Mol. Mass.231.2505
SMILESNC(=O)c1cn(cn1)C(CO)c1ccccc1