Reaction Details
TargetAdenosine deaminase
LigandBDBM22927
Substrate/CompetitorBDBM14487
Meas. Tech.ADA Inhibition Assay
pH7.4±n/a
Temperature295.15±n/a K
Ki 1300±n/a nM
Citation Terasaka, TKinoshita, TKuno, MSeki, NTanaka, KNakanishi, I Structure-based design, synthesis, and structure-activity relationship studies of novel non-nucleoside adenosine deaminase inhibitors. J Med Chem47:3730-43 (2004) 
 
Adenosine deaminase
Name:Adenosine deaminase
Type:Enzyme
Mol. Mass.:40759.44
Organism:Homo sapiens (Human)
Description:Human recombinant ADA was expressed and purified from an ADA-deficient bacterial strain.
Residue:363
BDBM22927
BDBM14487
NameBDBM22927
Synonyms:1-[(2R)-4-(6-acetamido-1H-indol-1-yl)-1-hydroxybutan-2-yl]-1H-imidazole-4-carboxamide | Hybrid compound 1(FR235999) derivative, 4a
TypeSmall organic molecule
Emp. Form.C18H21N5O3
Mol. Mass.355.391
SMILESCC(=O)Nc1ccc2ccn(CC[C@H](CO)n3cnc(c3)C(N)=O)c2c1