Reaction Details
TargetAdenosine deaminase
LigandBDBM22936
Substrate/CompetitorBDBM14487
Meas. Tech.ADA Inhibition Assay
pH7.4±n/a
Temperature295.15±n/a K
Ki 17±n/a nM
Citation Terasaka, TKinoshita, TKuno, MSeki, NTanaka, KNakanishi, I Structure-based design, synthesis, and structure-activity relationship studies of novel non-nucleoside adenosine deaminase inhibitors. J Med Chem47:3730-43 (2004) 
 
Adenosine deaminase
Name:Adenosine deaminase
Type:Enzyme
Mol. Mass.:40759.44
Organism:Homo sapiens (Human)
Description:Human recombinant ADA was expressed and purified from an ADA-deficient bacterial strain.
Residue:363
BDBM22936
BDBM14487
NameBDBM22936
Synonyms:1-[(2R)-1-hydroxy-4-{6-[3-(pyridin-3-yl)propanamido]-1H-indol-1-yl}butan-2-yl]-1H-imidazole-4-carboxamide | Hybrid compound 1(FR235999) derivative, 4j
TypeSmall organic molecule
Emp. Form.C24H26N6O3
Mol. Mass.446.5016
SMILESNC(=O)c1cn(cn1)[C@@H](CO)CCn1ccc2ccc(NC(=O)CCc3cccnc3)cc12