Reaction Details
TargetAdenosine deaminase
LigandBDBM22943
Substrate/CompetitorBDBM14487
Meas. Tech.ADA Inhibition Assay
pH7.4±n/a
Temperature295.15±n/a K
Ki 1900±n/a nM
Citation Terasaka, TKinoshita, TKuno, MSeki, NTanaka, KNakanishi, I Structure-based design, synthesis, and structure-activity relationship studies of novel non-nucleoside adenosine deaminase inhibitors. J Med Chem47:3730-43 (2004) 
 
Adenosine deaminase
Name:Adenosine deaminase
Type:Enzyme
Mol. Mass.:40759.44
Organism:Homo sapiens (Human)
Description:Human recombinant ADA was expressed and purified from an ADA-deficient bacterial strain.
Residue:363
BDBM22943
BDBM14487
NameBDBM22943
Synonyms:1-[(2R)-1-hydroxy-4-[5-(3-phenylpropoxy)-1H-indol-1-yl]butan-2-yl]-1H-imidazole-4-carboxamide | Hybrid compound 1(FR235999) derivative, 7a
TypeSmall organic molecule
Emp. Form.C25H28N4O3
Mol. Mass.432.5148
SMILESNC(=O)c1cn(cn1)[C@@H](CO)CCn1ccc2cc(OCCCc3ccccc3)ccc12