Reaction Details
TargetSerine/threonine-protein kinase PLK4
LigandBDBM50073586
Substrate/Competitorn/a
Meas. Tech.Inhibition Assay
IC50<100±n/a nM
Citation Sampson, PBLiu, YLi, SForrest, BTPauls, HWEdwards, LGFeher, MPatel, NKLaufer, R Kinase inhibitors and method of treating cancer US Patent US9907800 Publication Date 3/6/2018
 
Serine/threonine-protein kinase PLK4
Name:Serine/threonine-protein kinase PLK4
Type:PROTEIN
Mol. Mass.:108996.91
Organism:Homo sapiens (Human)
Description:ChEMBL_1474078
Residue:970
BDBM50073586
NameBDBM50073586
Synonyms:CHEMBL3408946 US9907800, Example A198
TypeSmall organic molecule
Emp. Form.C32H32N4O2
Mol. Mass.504.6221
SMILESC[C@H]1CN(Cc2ccc(\C=C\c3n[nH]c4cc(ccc34)[C@@H]3C[C@@]33C(=O)Nc4ccccc34)cc2)C[C@@H](C)O1