Reaction Details
TargetSphingosine 1-phosphate receptor 5
LigandBDBM23164
Substrate/CompetitorBDBM22202
Meas. Tech.[32P] S1P Binding Assay
pH7.5±n/a
Temperature277.15±n/a K
Ki 121±9.5 nM
Citation Kiuchi, MAdachi, KTomatsu, AChino, MTakeda, STanaka, YMaeda, YSato, NMitsutomi, NSugahara, KChiba, K Asymmetric synthesis and biological evaluation of the enantiomeric isomers of the immunosuppressive FTY720-phosphate. Bioorg Med Chem13:425-32 (2005) 
 
Sphingosine 1-phosphate receptor 5
Name:Sphingosine 1-phosphate receptor 5
Type:G Protein-Coupled Receptor (GPCR)
Mol. Mass.:41796.42
Organism:Homo sapiens (Human)
Description:n/a
Residue:398
BDBM23164
BDBM22202
NameBDBM23164
Synonyms:CHEMBL190006 [(2R)-2-amino-3-hydroxy-2-[2-(4-octylphenyl)ethyl]propoxy]phosphonic acid
TypeSmall organic molecule
Emp. Form.C19H34NO5P
Mol. Mass.387.4507
SMILESCCCCCCCCc1ccc(CC[C@@](N)(CO)COP(O)(O)=O)cc1