Reaction Details
TargetAlpha-amylase 1A
LigandBDBM23411
Substrate/CompetitorBDBM23407
Meas. Tech.In Vitro alpha-Amylase Activity Assay
pH6±n/a
Temperature295.15±n/a K
IC50 9640±300 nM
Citation Lo Piparo, EScheib, HFrei, NWilliamson, GGrigorov, MChou, CJ Flavonoids for controlling starch digestion: structural requirements for inhibiting human alpha-amylase. J Med Chem51:3555-61 (2008) 
 
Alpha-amylase 1A
Name:Alpha-amylase 1A
Type:Glycosidase
Mol. Mass.:57770.18
Organism:Homo sapiens (Human)
Description:Purchased from Sigma Chemical Co.
Residue:511
BDBM23411
BDBM23407
NameBDBM23411
Synonyms:5,6,7-trihydroxy-2-(4-hydroxyphenyl)-4H-chromen-4-one Scutellarein Scutellarein (28) | US10252984, Table 2.2
Typeflavone
Emp. Form.C15H10O6
Mol. Mass.286.2363
SMILESOc1ccc(cc1)-c1cc(=O)c2c(O)c(O)c(O)cc2o1