Reaction Details
TargetDisintegrin and metalloproteinase domain-containing protein 17 [215-477,S266A,N452Q]
LigandBDBM23470
Substrate/CompetitorBDBM23453
Meas. Tech.TACE Inhibition Assay
pH7.3±n/a
Temperature295.15±n/a K
Ki 50±n/a nM
Citation Zhu, ZMazzola, RSinning, LMcKittrick, BNiu, XLundell, DSun, JOrth, PGuo, ZMadison, VIngram, RBeyer, BM Discovery of novel hydroxamates as highly potent tumor necrosis factor-alpha converting enzyme inhibitors: Part I--discovery of two binding modes. J Med Chem51:725-36 (2008) 
 
Disintegrin and metalloproteinase domain-containing protein 17 [215-477,S266A,N452Q]
Name:Disintegrin and metalloproteinase domain-containing protein 17 [215-477,S266A,N452Q]
Type:Single-pass type I membrane protein; metalloprotease
Mol. Mass.:29695.98
Organism:Homo sapiens (Human)
Description:The catalytic domain of recombinant human TNF-converting enzyme (residues 215-477) with two mutations (S266A and N452Q) and a 6xHis was purified from the baculovirus/Hi5 cells expression system.
Residue:263
BDBM23470
BDBM23453
NameBDBM23470
Synonyms:hydroxamate deriv., 62 | methyl (1R,2R)-1-[3-(2-{3-[(1Z)-buta-1,3-dien-1-yl]phenyl}ethoxy)phenyl]-2-(hydroxycarbamoyl)cyclopropane-1-carboxylate
TypeSmall organic molecule
Emp. Form.C24H25NO5
Mol. Mass.407.459
SMILESCOC(=O)[C@@]1(C[C@H]1C(=O)NO)c1cccc(OCCc2cccc(\C=C/C=C)c2)c1