Reaction Details
TargetDisintegrin and metalloproteinase domain-containing protein 17 [215-477,S266A,N452Q]
LigandBDBM23487
Substrate/CompetitorBDBM23453
Meas. Tech.TACE Inhibition Assay
Ki 3±n/a nM
Citation Zhu, ZMazzola, RSinning, LMcKittrick, BNiu, XLundell, DSun, JOrth, PGuo, ZMadison, VIngram, RBeyer, BM Discovery of novel hydroxamates as highly potent tumor necrosis factor-alpha converting enzyme inhibitors: Part I--discovery of two binding modes. J Med Chem51:725-36 (2008) 
 
Disintegrin and metalloproteinase domain-containing protein 17 [215-477,S266A,N452Q]
Name:Disintegrin and metalloproteinase domain-containing protein 17 [215-477,S266A,N452Q]
Type:Single-pass type I membrane protein; metalloprotease
Mol. Mass.:29695.98
Organism:Homo sapiens (Human)
Description:The catalytic domain of recombinant human TNF-converting enzyme (residues 215-477) with two mutations (S266A and N452Q) and a 6xHis was purified from the baculovirus/Hi5 cells expression system.
Residue:263
BDBM23487
BDBM23453
NameBDBM23487
Synonyms:(1S,2R)-1-N-hydroxy-2-({4-[(2-methylquinolin-4-yl)methoxy]phenyl}methyl)cyclopropane-1,2-dicarboxamide hydroxamate deriv., 78
TypeSmall organic molecule
Emp. Form.C23H23N3O4
Mol. Mass.405.4464
SMILESCc1cc(COc2ccc(C[C@@]3(C[C@@H]3C(=O)NO)C(N)=O)cc2)c2ccccc2n1