Reaction Details
TargetDisintegrin and metalloproteinase domain-containing protein 17 [215-477,S266A,N452Q]
LigandBDBM23490
Substrate/CompetitorBDBM23453
Meas. Tech.TACE Inhibition Assay
Ki 130±n/a nM
Citation Zhu, ZMazzola, RSinning, LMcKittrick, BNiu, XLundell, DSun, JOrth, PGuo, ZMadison, VIngram, RBeyer, BM Discovery of novel hydroxamates as highly potent tumor necrosis factor-alpha converting enzyme inhibitors: Part I--discovery of two binding modes. J Med Chem51:725-36 (2008) 
 
Disintegrin and metalloproteinase domain-containing protein 17 [215-477,S266A,N452Q]
Name:Disintegrin and metalloproteinase domain-containing protein 17 [215-477,S266A,N452Q]
Type:Single-pass type I membrane protein; metalloprotease
Mol. Mass.:29695.98
Organism:Homo sapiens (Human)
Description:The catalytic domain of recombinant human TNF-converting enzyme (residues 215-477) with two mutations (S266A and N452Q) and a 6xHis was purified from the baculovirus/Hi5 cells expression system.
Residue:263
BDBM23490
BDBM23453
NameBDBM23490
Synonyms:hydroxamate deriv., 81 | methyl (1R,2S)-1-({4-[(3,4-dichlorophenyl)methoxy]phenyl}methyl)-2-(hydroxycarbamoyl)cyclopropane-1-carboxylate
TypeSmall organic molecule
Emp. Form.C20H19Cl2NO5
Mol. Mass.424.275
SMILESCOC(=O)[C@@]1(Cc2ccc(OCc3ccc(Cl)c(Cl)c3)cc2)C[C@@H]1C(=O)NO