Reaction Details
TargetTyrosine-protein kinase BTK
LigandBDBM164875
Substrate/Competitorn/a
Meas. Tech.Enzyme Assay
IC50 0.110±n/a nM
Citation Liu, QWatterson, SHAhmad, S Indole carboxamide compounds US Patent US9920031 Publication Date 3/20/2018
 
Tyrosine-protein kinase BTK
Name:Tyrosine-protein kinase BTK
Type:Enzyme
Mol. Mass.:76289.95
Organism:Homo sapiens (Human)
Description:Q06187
Residue:659
BDBM164875
NameBDBM164875
Synonyms:US10604504, Example 23 US9688629, 23 US9920031, Example 23
TypeSmall organic molecule
Emp. Form.C21H23N3O3S
Mol. Mass.397.491
SMILESCN(c1cccc(c1C)-c1ccc(C(N)=O)c2[nH]c(C)c(C)c12)S(=O)(=O)C=C