Reaction Details
TargetAmine oxidase [flavin-containing] A
LigandBDBM256651
Substrate/Competitorn/a
Meas. Tech.Inhibition Assay
IC50>100000±n/a nM
Citation Matsumoto, SHattori, YToyofuku, MMorimoto, SDaini, MKojima, TKaku, TIto, M Cyclopropanamine compound and use thereof US Patent US9920047 Publication Date 3/20/2018
 
Amine oxidase [flavin-containing] A
Name:Amine oxidase [flavin-containing] A
Type:Protein
Mol. Mass.:59689.53
Organism:Homo sapiens (Human)
Description:P21397
Residue:527
BDBM256651
NameBDBM256651
Synonyms:US10053456, 30 US10968213, Example 30 US9718814, 30 | US9920047, 30
TypeSmall organic molecule
Emp. Form.C18H24F2N2OS
Mol. Mass.354.458
SMILESFC1(F)CCC(CC1)NC(=O)c1csc(c1)C1CC1NCC1CC1