Reaction Details
TargetAryl hydrocarbon receptor
LigandBDBM23939
Substrate/CompetitorBDBM23927
Meas. Tech.In Vitro Binding Assay
pH7.6±n/a
Temperature277.15±n/a K
Ki 5.7±1.1 nM
CommentsAntagonist.
Citation de Medina, PCasper, RSavouret, JFPoirot, M Synthesis and biological properties of new stilbene derivatives of resveratrol as new selective aryl hydrocarbon modulators. J Med Chem48:287-91 (2005) 
 
Aryl hydrocarbon receptor
Name:Aryl hydrocarbon receptor
Type:Transcription factor
Mol. Mass.:94428.00
Organism:Oryctolagus cuniculus (rabbit)
Description:Cytosols from rabbit liver were used in binding assay.
Residue:847
BDBM23939
BDBM23927
NameBDBM23939
Synonyms:1,3-dichloro-5-[(E)-2-(3-methoxyphenyl)ethenyl]benzene | trans-Stilbene Derivative, 4l
TypeSmall organic molecule
Emp. Form.C15H12Cl2O
Mol. Mass.279.161
SMILESCOc1cccc(\C=C\c2cc(Cl)cc(Cl)c2)c1