Reaction Details
TargetAminopeptidase N
LigandBDBM23985
Substrate/CompetitorBDBM23972
Meas. Tech.Enzyme Inhibition Assay
IC50>1000000±n/a nM
Citation Albrecht, SDefoin, ASalomon, ETarnus, CWetterholm, AHaeggström, JZ Synthesis and structure activity relationships of novel non-peptidic metallo-aminopeptidase inhibitors. Bioorg Med Chem14:7241-57 (2006) 
 
Aminopeptidase N
Name:Aminopeptidase N
Type:Protein
Mol. Mass.:108810.25
Organism:Sus scrofa (Pig)
Description:P15145
Residue:963
BDBM23985
BDBM23972
NameBDBM23985
Synonyms:3,4-dihydro-1H-2-benzopyran-3-one | isochromanone, 4a
TypeSmall organic molecule
Emp. Form.C9H8O2
Mol. Mass.148.1586
SMILESO=C1Cc2ccccc2CO1