Reaction Details
TargetHistone-lysine N-methyltransferase SMYD3
LigandBDBM378450
Substrate/Competitorn/a
Meas. Tech.SMYD3 Biochemical Assay
IC50 1.10±n/a nM
Citation Foley, MAKuntz, KWMills, JEMitchell, LHMunchhof, MJHarvey, DM Substituted 1,2,3-triazoles as SMYD inhibitors for treating cancer US Patent US10266526 Publication Date 4/23/2019
 
Histone-lysine N-methyltransferase SMYD3
Name:Histone-lysine N-methyltransferase SMYD3
Type:Enzyme
Mol. Mass.:49101.22
Organism:Homo sapiens (Human)
Description:Q9H7B4-2
Residue:428
BDBM378450
NameBDBM378450
Synonyms:N-((1R,3R,5S)-8-(((1r,4R)-4-aminocyclohexyl)sulfonyl)-8-azabicyclo[3.2.1]octan-3-yl)-6-chloro-2-oxoindoline-5-carboxamide | US10266526, Compound 583
TypeSmall organic molecule
Emp. Form.C22H29ClN4O4S
Mol. Mass.481.008
SMILESN[C@H]1CC[C@@H](CC1)S(=O)(=O)N1[C@H]2CC[C@@H]1C[C@@H](C2)NC(=O)c1cc2CC(=O)Nc2cc1Cl