Reaction Details
TargetHistone-lysine N-methyltransferase SMYD3
LigandBDBM378457
Substrate/Competitorn/a
Meas. Tech.SMYD3 Biochemical Assay
IC50 2.14±n/a nM
Citation Foley, MAKuntz, KWMills, JEMitchell, LHMunchhof, MJHarvey, DM Substituted 1,2,3-triazoles as SMYD inhibitors for treating cancer US Patent US10266526 Publication Date 4/23/2019
 
Histone-lysine N-methyltransferase SMYD3
Name:Histone-lysine N-methyltransferase SMYD3
Type:Enzyme
Mol. Mass.:49101.22
Organism:Homo sapiens (Human)
Description:Q9H7B4-2
Residue:428
BDBM378457
NameBDBM378457
Synonyms:2-oxo-N-((1R,3r,5S)-8-((piperidin-3-ylmethyl)sulfonyl)-8-azabicyclo[3.2.1]octan-3-yl)indoline-5-carboxamide | US10266526, Compound 590
TypeSmall organic molecule
Emp. Form.C22H30N4O4S
Mol. Mass.446.563
SMILESO=C(N[C@@H]1C[C@@H]2CC[C@H](C1)N2S(=O)(=O)CC1CCCNC1)c1ccc2NC(=O)Cc2c1