Reaction Details
TargetMuscarinic acetylcholine receptor M1
LigandBDBM261732
Substrate/Competitorn/a
Meas. Tech.M1 PAM Assay
EC50 2.00±n/a nM
Citation Groebke Zbinden, KPinard, ERyckmans, T Flouro-naphthyl derivatives US Patent US9708302 Publication Date 7/18/2017
 
Muscarinic acetylcholine receptor M1
Name:Muscarinic acetylcholine receptor M1
Type:Enzyme Catalytic Domain
Mol. Mass.:51390.46
Organism:RAT
Description:P08482
Residue:460
BDBM261732
NameBDBM261732
Synonyms:1-fluoro-N- ((3RS,4SR)-3- hydroxytetrahydro- 2H-pyran-4-yl)-4- ((6-(1-methyl-1H- pyrazol-4-yl)pyridin- 3-yl)methyl)-2- naphthamide US9708302, 20
TypeSmall organic molecule
Emp. Form.C26H25FN4O3
Mol. Mass.460.5001
SMILESCn1cc(cn1)-c1ccc(Cc2cc(C(=O)N[C@H]3CCOC[C@@H]3O)c(F)c3ccccc23)cn1