Reaction Details
TargetMuscarinic acetylcholine receptor M1
LigandBDBM261738
Substrate/Competitorn/a
Meas. Tech.M1 PAM Assay
EC50 347±n/a nM
Citation Groebke Zbinden, KPinard, ERyckmans, T Flouro-naphthyl derivatives US Patent US9708302 Publication Date 7/18/2017
 
Muscarinic acetylcholine receptor M1
Name:Muscarinic acetylcholine receptor M1
Type:Enzyme Catalytic Domain
Mol. Mass.:51390.46
Organism:RAT
Description:P08482
Residue:460
BDBM261738
NameBDBM261738
Synonyms:4-((6-Cyclopropylpyridin-3-yl)methyl)-1-fluoro-N-((1S,2S)-2-hydroxycyclohexyl)-2-naphthamide | US9708302, 24
TypeSmall organic molecule
Emp. Form.C26H27FN2O2
Mol. Mass.418.5032
SMILESO[C@H]1CCCC[C@@H]1NC(=O)c1cc(Cc2ccc(nc2)C2CC2)c2ccccc2c1F