Reaction Details
TargetDihydroorotate dehydrogenase (quinone), mitochondrial
LigandBDBM24401
Substrate/CompetitorBDBM15346
Meas. Tech.DHODH Inhibition Assay
pH8±n/a
Temperature293.15±n/a K
IC50 210±70 nM
Citation Phillips, MAGujjar, RMalmquist, NAWhite, JEl Mazouni, FBaldwin, JRathod, PK Triazolopyrimidine-based dihydroorotate dehydrogenase inhibitors with potent and selective activity against the malaria parasite Plasmodium falciparum. J Med Chem51:3649-53 (2008) 
 
Dihydroorotate dehydrogenase (quinone), mitochondrial
Name:Dihydroorotate dehydrogenase (quinone), mitochondrial
Type:Enzyme
Mol. Mass.:65581.88
Organism:Plasmodium falciparum (isolate 3D7)
Description:Q08210
Residue:569
BDBM24401
BDBM15346
NameBDBM24401
Synonyms:N-(naphthalen-2-yl)-5-(trifluoromethyl)-[1,2,4]triazolo[1,5-a]pyrimidin-7-amine | Triazolopyrimidine-Based Compound, 8
TypeSmall organic molecule
Emp. Form.C16H10F3N5
Mol. Mass.329.2793
SMILESFC(F)(F)c1cc(Nc2ccc3ccccc3c2)n2ncnc2n1