Reaction Details
TargetDihydroorotate dehydrogenase (quinone), mitochondrial
LigandBDBM24408
Substrate/CompetitorBDBM15346
Meas. Tech.DHODH Inhibition Assay
pH8±n/a
Temperature293.15±n/a K
IC50 1200±280 nM
Citation Phillips, MAGujjar, RMalmquist, NAWhite, JEl Mazouni, FBaldwin, JRathod, PK Triazolopyrimidine-based dihydroorotate dehydrogenase inhibitors with potent and selective activity against the malaria parasite Plasmodium falciparum. J Med Chem51:3649-53 (2008) 
 
Dihydroorotate dehydrogenase (quinone), mitochondrial
Name:Dihydroorotate dehydrogenase (quinone), mitochondrial
Type:Enzyme
Mol. Mass.:65581.88
Organism:Plasmodium falciparum (isolate 3D7)
Description:Q08210
Residue:569
BDBM24408
BDBM15346
NameBDBM24408
Synonyms:N-{5-methyl-[1,2,4]triazolo[1,5-a]pyrimidin-7-yl}quinolin-6-amine | Triazolopyrimidine-Based Compound, 15
TypeSmall organic molecule
Emp. Form.C15H12N6
Mol. Mass.276.296
SMILESCc1cc(Nc2ccc3ncccc3c2)n2ncnc2n1