Reaction Details
TargetPhosphatidylinositol 4,5-bisphosphate 3-kinase catalytic subunit gamma isoform
LigandBDBM25083
Substrate/CompetitorBDBM15235
Meas. Tech.Determination of PI3K Activity
pH7.4±n/a
Temperature295.15±n/a K
IC50 85±n/a nM
Citation Doukas, JWrasidlo, WNoronha, GDneprovskaia, EFine, RWeis, SHood, JDemaria, ASoll, RCheresh, D Phosphoinositide 3-kinase gamma/delta inhibition limits infarct size after myocardial ischemia/reperfusion injury. Proc Natl Acad Sci U S A103:19866-71 (2006) 
 
Phosphatidylinositol 4,5-bisphosphate 3-kinase catalytic subunit gamma isoform
Name:Phosphatidylinositol 4,5-bisphosphate 3-kinase catalytic subunit gamma isoform
Type:Enzyme Subunit
Mol. Mass.:126470.30
Organism:Homo sapiens (Human)
Description:P48736
Residue:1102
BDBM25083
BDBM15235
NameBDBM25083
Synonyms:6-(1H-indol-4-yl)-pteridin-2,4-diamine TG101110
TypeSmall organic molecule
Emp. Form.C14H11N7
Mol. Mass.277.284
SMILESNc1nc(N)c2nc(cnc2n1)-c1cccc2[nH]ccc12