Reaction Details
TargetPhosphatidylinositol 3-kinase regulatory subunit alpha/4,5-bisphosphate 3-kinase catalytic subunit delta isoform
LigandBDBM15234
Substrate/CompetitorBDBM15235
Meas. Tech.Determination of PI3K Activity
pH7.4±n/a
Temperature295.15±n/a K
IC50 103±n/a nM
Citation Doukas, JWrasidlo, WNoronha, GDneprovskaia, EFine, RWeis, SHood, JDemaria, ASoll, RCheresh, D Phosphoinositide 3-kinase gamma/delta inhibition limits infarct size after myocardial ischemia/reperfusion injury. Proc Natl Acad Sci U S A103:19866-71 (2006) 
 
Phosphatidylinositol 3-kinase regulatory subunit alpha/4,5-bisphosphate 3-kinase catalytic subunit delta isoform
Name:Phosphatidylinositol 3-kinase regulatory subunit alpha/4,5-bisphosphate 3-kinase catalytic subunit delta isoform
Type:Heterodimer of a p110 (catalytic) and a p85 (regulatory) subunit
Mol. Mass.:n/a
Description:Recombinant human p110delta was coexpressed in an Sf9 baculovirus system with the p85alpha regulatory subunit and purified as GST-fusion protein using affinity chromatography on glutathione-sepharose.
Components:This complex has 2 components.
Component 1
Name:Phosphatidylinositol 4,5-bisphosphate 3-kinase catalytic subunit delta isoform
Synonyms:PI3-kinase p110 subunit delta PI3-kinase subunit p110-delta PIK3CD Phosphatidylinositol 4,5-biphosphate 3-kinase catalytic subunit delta (PIK3CD) Phosphatidylinositol 4,5-bisphosphate 3-kinase 110 kDa catalytic subunit delta (PI3K delta) Phosphatidylinositol 4,5-bisphosphate 3-kinase catalytic subunit delta (PI3Kdelta) Phosphatidylinositol 4,5-bisphosphate 3-kinase catalytic subunit delta isoform (PI3K delta) Phosphatidylinositol 4,5-bisphosphate 3-kinase catalytic subunit delta isoform (PI3K-delta) Phosphatidylinositol 4,5-bisphosphate 3-kinase catalytic subunit delta isoform (PI3Kdelta)
Type:Enzyme Subunit
Mol. Mass.:119489.41
Organism:Homo sapiens (Human)
Description:O00329
Residue:1044
Component 2
Name:Phosphatidylinositol 3-kinase regulatory subunit alpha
Synonyms:GRB1 PI3-kinase class I PI3-kinase p85-alpha subunit PI3-kinase subunit p85-alpha PIK3CG/PIK3R1 Phosphatidylinositol 3-kinase 85 kDa regulatory subunit alpha (PI3K alpha) Phosphatidylinositol 3-kinase regulatory subunit alpha (PIK3R1) Phosphatidylinositol 3-kinase regulatory subunit alpha isoform 1 (PI3 Kinase alpha) Phosphatidylinositol 4,5-bisphosphate 3-kinase catalytic subunit alpha isoform (PI3Kalpha) PtdIns-3-kinase p85-alpha p85 alpha
Type:Protein
Mol. Mass.:83592.82
Organism:Homo sapiens (Human)
Description:P27986
Residue:724
BDBM15234
BDBM15235
NameBDBM15234
Synonyms:(1R,3R,5S,9R,18S)-18-(methoxymethyl)-1,5-dimethyl-6,11,16-trioxo-13,17-dioxapentacyclo[10.6.1.0^{2,10}.0^{5,9}.0^{15,19}]nonadeca-2(10),12(19),14-trien-3-yl acetate NSC221019 Wortmannin, Wm | cid_312145
TypeAntibiotic
Emp. Form.C23H24O8
Mol. Mass.428.4319
SMILES[H][C@@]12CCC(=O)[C@@]1(C)C[C@@H](OC(C)=O)C1=C2C(=O)c2occ3c2[C@]1(C)[C@@H](COC)OC3=O