Reaction Details
TargetHistone deacetylase 5
LigandBDBM25148
Substrate/CompetitorBDBM25149
Meas. Tech.HDAC Activity Assay
Temperature298.15±n/a K
IC50>10000±n/a nM
Commentsextracted
Citation Jones, PAltamura, SDe Francesco, RPaz, OGKinzel, OMesiti, GMonteagudo, EPescatore, GRowley, MVerdirame, MSteinkühler, C A novel series of potent and selective ketone histone deacetylase inhibitors with antitumor activity in vivo. J Med Chem51:2350-3 (2008) 
 
Histone deacetylase 5
Name:Histone deacetylase 5
Type:Enzyme
Mol. Mass.:121968.61
Organism:Homo sapiens (Human)
Description:Q9UQL6
Residue:1122
BDBM25148
BDBM25149
NameBDBM25148
Synonyms:2-(5-methoxy-2-methyl-1H-indol-3-yl)-N-[(1S)-7-oxo-1-(5-phenyl-1H-imidazol-2-yl)nonyl]acetamide | 4-phenylimidazole, 19
TypeSmall organic molecule
Emp. Form.C30H36N4O3
Mol. Mass.500.6318
SMILESCCC(=O)CCCCC[C@H](NC(=O)Cc1c(C)[nH]c2ccc(OC)cc12)c1nc(c[nH]1)-c1ccccc1