Reaction Details
TargetHistone deacetylase 7
LigandBDBM21709
Substrate/CompetitorBDBM25149
Meas. Tech.HDAC Activity Assay
Temperature298.15±n/a K
IC50>10000±n/a nM
Commentsextracted
Citation Jones, PAltamura, SDe Francesco, RPaz, OGKinzel, OMesiti, GMonteagudo, EPescatore, GRowley, MVerdirame, MSteinkühler, C A novel series of potent and selective ketone histone deacetylase inhibitors with antitumor activity in vivo. J Med Chem51:2350-3 (2008) 
 
Histone deacetylase 7
Name:Histone deacetylase 7
Type:Chromatin regulator; hydrolase; repressor
Mol. Mass.:102942.62
Organism:Homo sapiens (Human)
Description:Q8WUI4
Residue:952
BDBM21709
BDBM25149
NameBDBM21709
Synonyms:2-ethyl-1-[(3R)-1-[(5-methoxy-1H-1,3-benzodiazol-2-yl)carbonyl]pyrrolidin-3-yl]-1H-1,3-benzodiazole | benzimidazole, 18
TypeSmall organic molecule
Emp. Form.C22H23N5O2
Mol. Mass.389.4503
SMILESCCc1nc2ccccc2n1[C@@H]1CCN(C1)C(=O)c1nc2ccc(OC)cc2[nH]1