Reaction Details
TargetHistone deacetylase 4
LigandBDBM25142
Substrate/CompetitorBDBM25149
Meas. Tech.HDAC Activity Assay
Temperature298.15±n/a K
IC50 8700±n/a nM
Commentsextracted
Citation Jones, PAltamura, SDe Francesco, RGallinari, PLahm, ANeddermann, PRowley, MSerafini, SSteinkühler, C Probing the elusive catalytic activity of vertebrate class IIa histone deacetylases. Bioorg Med Chem Lett18:1814-9 (2008) 
 
Histone deacetylase 4
Name:Histone deacetylase 4
Type:Enzyme
Mol. Mass.:119049.39
Organism:Homo sapiens (Human)
Description:P56524
Residue:1084
BDBM25142
BDBM25149
NameBDBM25142
Synonyms:(3S,6S,9S,15aR)-9-[(2R)-butan-2-yl]-6-[(1-methoxy-1H-indol-3-yl)methyl]-3-(6-oxooctyl)-tetradecahydro-1H-pyrido[1,2-a][,,,]cyclododecane-1,4,7,10-tetrone | Apicidin
TypeSmall organic molecule
Emp. Form.C34H49N5O6
Mol. Mass.623.7828
SMILESCCC(C)[C@@H]1NC(=O)[C@H](Cc2cn(OC)c3ccccc23)NC(=O)[C@H](CCCCCC(=O)CC)NC(=O)[C@H]2CCCCN2C1=O