Reaction Details
TargetHistone deacetylase 3
LigandBDBM25158
Substrate/CompetitorBDBM25143
Meas. Tech.HDAC Activity Assay
Temperature298.15±n/a K
IC50 230±n/a nM
Commentsextracted
Citation Jones, PBottomley, MJCarfí, ACecchetti, OFerrigno, FLo Surdo, POntoria, JMRowley, MScarpelli, RSchultz-Fademrecht, CSteinkühler, C 2-Trifluoroacetylthiophenes, a novel series of potent and selective class II histone deacetylase inhibitors. Bioorg Med Chem Lett18:3456-61 (2008) 
 
Histone deacetylase 3
Name:Histone deacetylase 3
Type:Enzyme
Mol. Mass.:48829.55
Organism:Homo sapiens (Human)
Description:O15379
Residue:428
BDBM25158
BDBM25143
NameBDBM25158
Synonyms:CHEMBL507716 thiophene derivative, 3d
TypeSmall organic molecule
Emp. Form.C15H12F3NO2S
Mol. Mass.327.321
SMILESC[C@@H](NC(=O)c1ccc(s1)C(=O)C(F)(F)F)c1ccccc1