Reaction Details
TargetHistone deacetylase 3
LigandBDBM25168
Substrate/CompetitorBDBM25143
Meas. Tech.HDAC Activity Assay
Temperature298.15±n/a K
IC50 10±n/a nM
Commentsextracted
Citation Jones, PBottomley, MJCarfí, ACecchetti, OFerrigno, FLo Surdo, POntoria, JMRowley, MScarpelli, RSchultz-Fademrecht, CSteinkühler, C 2-Trifluoroacetylthiophenes, a novel series of potent and selective class II histone deacetylase inhibitors. Bioorg Med Chem Lett18:3456-61 (2008) 
 
Histone deacetylase 3
Name:Histone deacetylase 3
Type:Enzyme
Mol. Mass.:48829.55
Organism:Homo sapiens (Human)
Description:O15379
Residue:428
BDBM25168
BDBM25143
NameBDBM25168
Synonyms:2-N-hydroxy-5-N-[(1R)-1-phenylethyl]thiophene-2,5-dicarboxamide | thiophene derivative, 8d
TypeSmall organic molecule
Emp. Form.C14H14N2O3S
Mol. Mass.290.338
SMILESC[C@@H](NC(=O)c1ccc(s1)C(=O)NO)c1ccccc1