Reaction Details
TargetHistone deacetylase 4 [653-1084,H976Y]
LigandBDBM25158
Substrate/CompetitorBDBM25143
Meas. Tech.HDAC Activity Assay
Temperature298.15±n/a K
IC50 160±n/a nM
Commentsextracted
Citation Jones, PBottomley, MJCarfí, ACecchetti, OFerrigno, FLo Surdo, POntoria, JMRowley, MScarpelli, RSchultz-Fademrecht, CSteinkühler, C 2-Trifluoroacetylthiophenes, a novel series of potent and selective class II histone deacetylase inhibitors. Bioorg Med Chem Lett18:3456-61 (2008) 
 
Histone deacetylase 4 [653-1084,H976Y]
Name:Histone deacetylase 4 [653-1084,H976Y]
Type:Catalytic domain
Mol. Mass.:46476.72
Organism:Homo sapiens (Human)
Description:His-tagged HDAC4 GOF(gain of function, H976Y) catalytic domains (T653-L1084) was expressed in E.coli and purified by Nickel-Chelation affinity chromatography and anion exchange (MonoQ) chromatography.
Residue:432
BDBM25158
BDBM25143
NameBDBM25158
Synonyms:CHEMBL507716 thiophene derivative, 3d
TypeSmall organic molecule
Emp. Form.C15H12F3NO2S
Mol. Mass.327.321
SMILESC[C@@H](NC(=O)c1ccc(s1)C(=O)C(F)(F)F)c1ccccc1