Reaction Details
TargetHistone deacetylase 4 [653-1084,H976Y]
LigandBDBM25177
Substrate/CompetitorBDBM25143
Meas. Tech.HDAC Activity Assay
Temperature298.15±n/a K
IC50 2700±n/a nM
Commentsextracted
Citation Jones, PBottomley, MJCarfí, ACecchetti, OFerrigno, FLo Surdo, POntoria, JMRowley, MScarpelli, RSchultz-Fademrecht, CSteinkühler, C 2-Trifluoroacetylthiophenes, a novel series of potent and selective class II histone deacetylase inhibitors. Bioorg Med Chem Lett18:3456-61 (2008) 
 
Histone deacetylase 4 [653-1084,H976Y]
Name:Histone deacetylase 4 [653-1084,H976Y]
Type:Catalytic domain
Mol. Mass.:46476.72
Organism:Homo sapiens (Human)
Description:His-tagged HDAC4 GOF(gain of function, H976Y) catalytic domains (T653-L1084) was expressed in E.coli and purified by Nickel-Chelation affinity chromatography and anion exchange (MonoQ) chromatography.
Residue:432
BDBM25177
BDBM25143
NameBDBM25177
Synonyms:2,2,2-trifluoro-1-(5-{[(4-methoxyphenyl)methoxy]methyl}thiophen-2-yl)ethan-1-one | thiophene derivative, 21f
TypeSmall organic molecule
Emp. Form.C15H13F3O3S
Mol. Mass.330.322
SMILESCOc1ccc(COCc2ccc(s2)C(=O)C(F)(F)F)cc1