Reaction Details
TargetHistone deacetylase 4
LigandBDBM25154
Substrate/CompetitorBDBM25149
Meas. Tech.HDAC Activity Assay
Temperature298.15±n/a K
IC50 2500±n/a nM
Commentsextracted
Citation Jones, PBottomley, MJCarfí, ACecchetti, OFerrigno, FLo Surdo, POntoria, JMRowley, MScarpelli, RSchultz-Fademrecht, CSteinkühler, C 2-Trifluoroacetylthiophenes, a novel series of potent and selective class II histone deacetylase inhibitors. Bioorg Med Chem Lett18:3456-61 (2008) 
 
Histone deacetylase 4
Name:Histone deacetylase 4
Type:Enzyme
Mol. Mass.:119049.39
Organism:Homo sapiens (Human)
Description:P56524
Residue:1084
BDBM25154
BDBM25149
NameBDBM25154
Synonyms:ethyl 5-(2,2,2-trifluoroacetyl)furan-2-carboxylate | furan derivative, 2
TypeSmall organic molecule
Emp. Form.C9H7F3O4
Mol. Mass.236.1447
SMILESCCOC(=O)c1ccc(o1)C(=O)C(F)(F)F