Reaction Details
TargetHistone deacetylase 4
LigandBDBM25163
Substrate/CompetitorBDBM25149
Meas. Tech.HDAC Activity Assay
Temperature298.15±n/a K
IC50 98±n/a nM
Commentsextracted
Citation Jones, PBottomley, MJCarfí, ACecchetti, OFerrigno, FLo Surdo, POntoria, JMRowley, MScarpelli, RSchultz-Fademrecht, CSteinkühler, C 2-Trifluoroacetylthiophenes, a novel series of potent and selective class II histone deacetylase inhibitors. Bioorg Med Chem Lett18:3456-61 (2008) 
 
Histone deacetylase 4
Name:Histone deacetylase 4
Type:Enzyme
Mol. Mass.:119049.39
Organism:Homo sapiens (Human)
Description:P56524
Residue:1084
BDBM25163
BDBM25149
NameBDBM25163
Synonyms:CHEMBL497332 thiophene derivative, 3i
TypeSmall organic molecule
Emp. Form.C17H12F3N3O2S
Mol. Mass.379.356
SMILESCN(Cc1ccc2nccnc2c1)C(=O)c1ccc(s1)C(=O)C(F)(F)F