Reaction Details
TargetHistone deacetylase 4
LigandBDBM25182
Substrate/CompetitorBDBM25149
Meas. Tech.HDAC Activity Assay
Temperature298.15±n/a K
IC50 760±n/a nM
Commentsextracted
Citation Jones, PBottomley, MJCarfí, ACecchetti, OFerrigno, FLo Surdo, POntoria, JMRowley, MScarpelli, RSchultz-Fademrecht, CSteinkühler, C 2-Trifluoroacetylthiophenes, a novel series of potent and selective class II histone deacetylase inhibitors. Bioorg Med Chem Lett18:3456-61 (2008) 
 
Histone deacetylase 4
Name:Histone deacetylase 4
Type:Enzyme
Mol. Mass.:119049.39
Organism:Homo sapiens (Human)
Description:P56524
Residue:1084
BDBM25182
BDBM25149
NameBDBM25182
Synonyms:N-benzyl-N-methyl-2-(2,2,2-trifluoroacetyl)-1,3-thiazole-5-carboxamide | thiazole derivative, 29c
TypeSmall organic molecule
Emp. Form.C14H11F3N2O2S
Mol. Mass.328.31
SMILESCN(Cc1ccccc1)C(=O)c1cnc(s1)C(=O)C(F)(F)F