Reaction Details
TargetHistone deacetylase 6
LigandBDBM25172
Substrate/CompetitorBDBM25143
Meas. Tech.HDAC Activity Assay
Temperature298.15±n/a K
IC50 15±n/a nM
Commentsextracted
Citation Jones, PBottomley, MJCarfí, ACecchetti, OFerrigno, FLo Surdo, POntoria, JMRowley, MScarpelli, RSchultz-Fademrecht, CSteinkühler, C 2-Trifluoroacetylthiophenes, a novel series of potent and selective class II histone deacetylase inhibitors. Bioorg Med Chem Lett18:3456-61 (2008) 
 
Histone deacetylase 6
Name:Histone deacetylase 6
Type:Chromatin regulator; hydrolase; repressor
Mol. Mass.:131381.51
Organism:Homo sapiens (Human)
Description:Q9UBN7
Residue:1215
BDBM25172
BDBM25143
NameBDBM25172
Synonyms:1-[5-(2,3-dihydro-1H-indol-1-ylcarbonyl)thiophen-2-yl]-2,2-difluoroethan-1-one | thiophene derivative, 15h
TypeSmall organic molecule
Emp. Form.C15H11F2NO2S
Mol. Mass.307.315
SMILESFC(F)C(=O)c1ccc(s1)C(=O)N1CCc2ccccc12