Reaction Details
TargetHistone deacetylase 6
LigandBDBM25176
Substrate/CompetitorBDBM25143
Meas. Tech.HDAC Activity Assay
Temperature298.15±n/a K
IC50 840±n/a nM
Commentsextracted
Citation Jones, PBottomley, MJCarfí, ACecchetti, OFerrigno, FLo Surdo, POntoria, JMRowley, MScarpelli, RSchultz-Fademrecht, CSteinkühler, C 2-Trifluoroacetylthiophenes, a novel series of potent and selective class II histone deacetylase inhibitors. Bioorg Med Chem Lett18:3456-61 (2008) 
 
Histone deacetylase 6
Name:Histone deacetylase 6
Type:Chromatin regulator; hydrolase; repressor
Mol. Mass.:131381.51
Organism:Homo sapiens (Human)
Description:Q9UBN7
Residue:1215
BDBM25176
BDBM25143
NameBDBM25176
Synonyms:2,2,2-trifluoro-1-[5-({[(1R)-1-phenylethyl]amino}methyl)thiophen-2-yl]ethan-1-one | thiophene derivative, 19d
TypeSmall organic molecule
Emp. Form.C15H14F3NOS
Mol. Mass.313.338
SMILESC[C@@H](NCc1ccc(s1)C(=O)C(F)(F)F)c1ccccc1