Reaction Details
TargetHistone deacetylase 6
LigandBDBM25179
Substrate/CompetitorBDBM25143
Meas. Tech.HDAC Activity Assay
Temperature298.15±n/a K
IC50 730±n/a nM
Commentsextracted
Citation Jones, PBottomley, MJCarfí, ACecchetti, OFerrigno, FLo Surdo, POntoria, JMRowley, MScarpelli, RSchultz-Fademrecht, CSteinkühler, C 2-Trifluoroacetylthiophenes, a novel series of potent and selective class II histone deacetylase inhibitors. Bioorg Med Chem Lett18:3456-61 (2008) 
 
Histone deacetylase 6
Name:Histone deacetylase 6
Type:Chromatin regulator; hydrolase; repressor
Mol. Mass.:131381.51
Organism:Homo sapiens (Human)
Description:Q9UBN7
Residue:1215
BDBM25179
BDBM25143
NameBDBM25179
Synonyms:N-benzyl-N-methyl-5-(2,2,2-trifluoroacetyl)thiophene-2-sulfonamide | thiophene derivative, 25c
TypeSmall organic molecule
Emp. Form.C14H12F3NO3S2
Mol. Mass.363.375
SMILESCN(Cc1ccccc1)S(=O)(=O)c1ccc(s1)C(=O)C(F)(F)F