Reaction Details
TargetSterol O-acyltransferase 1
LigandBDBM383178
Substrate/Competitorn/a
Meas. Tech.Inhibitory Effect on ACAT2 Activity
IC50 17770±n/a nM
Citation Nan, FLi, BZhan, YZhang, XXiong, YHu, XZhang, Y Tricyclic analogues, preparation method and uses thereof US Patent US10278962 Publication Date 5/7/2019
 
Sterol O-acyltransferase 1
Name:Sterol O-acyltransferase 1
Type:Multi-pass membrane protein may form homo- or heterodimers.
Mol. Mass.:64751.94
Organism:Homo sapiens (Human)
Description:P35610
Residue:550
BDBM383178
NameBDBM383178
Synonyms:US10278962, Compound 13
TypeSmall organic molecule
Emp. Form.C37H29N3O9
Mol. Mass.659.6409
SMILESCC(O)(COC(=O)c1ccc(cc1)C#N)[C@@H]1C[C@H](OC(=O)c2ccc(cc2)C#N)[C@@]2(C)Oc3cc(oc(=O)c3C(=O)[C@@H]2C1)-c1cccnc1