Reaction Details
TargetATP phosphoribosyltransferase
LigandBDBM25323
Substrate/CompetitorBDBM25315
Meas. Tech.Enzyme Inhibition Assay
pH8.5±n/a
Temperature295.15±n/a K
IC50 11900±n/a nM
Comments46% inhibition @ 10 uM.
Citation Cho, YIoerger, TRSacchettini, JC Discovery of novel nitrobenzothiazole inhibitors for Mycobacterium tuberculosis ATP phosphoribosyl transferase (HisG) through virtual screening. J Med Chem51:5984-92 (2008) 
 
ATP phosphoribosyltransferase
Name:ATP phosphoribosyltransferase
Type:Glycosyltransferase
Mol. Mass.:30473.85
Organism:Mycobacterium tuberculosis
Description:n/a
Residue:284
BDBM25323
BDBM25315
NameBDBM25323
Synonyms:2-({7-[(3-hydroxyphenyl)amino]-4-nitro-2,1,3-benzoxadiazol-5-yl}amino)-5-nitrophenol | ChemBridge benzoxadiazole, 18
TypeSmall organic molecule
Emp. Form.C18H12N6O7
Mol. Mass.424.3239
SMILESOc1cccc(Nc2cc(Nc3ccc(cc3O)[N+]([O-])=O)c([N+]([O-])=O)c3nonc23)c1