Reaction Details
TargetBeta-2 adrenergic receptor
LigandBDBM25392
Substrate/CompetitorBDBM25393
Meas. Tech.beta2 Adrenergic Receptor Binding Assay
pH7.4±n/a
Temperature295.15±n/a K
Ki 136±25 nM
Citation Karellas, PMcNaughton, MBaker, SPScammells, PJ Synthesis of bivalent beta2-adrenergic and adenosine A1 receptor ligands. J Med Chem51:6128-37 (2008) 
 
Beta-2 adrenergic receptor
Name:Beta-2 adrenergic receptor
Type:n/a
Mol. Mass.:46461.69
Organism:Homo sapiens (Human)
Description:P07550
Residue:413
BDBM25392
BDBM25393
NameBDBM25392
Synonyms:4-[1-hydroxy-2-(isopropylamino)ethyl]pyrocatechol;hydrochloride 4-{1-hydroxy-2-[(propan-2-yl)amino]ethyl}benzene-1,2-diol, 2 ISOPROTERONOL Isoproterenol Isoproterenol,(+) Norisodrine | Novodrin
TypeSmall organic molecule
Emp. Form.C11H17NO3
Mol. Mass.211.2576
SMILESCC(C)NCC(O)c1ccc(O)c(O)c1