Reaction Details
TargetLanosterol 14-alpha demethylase
LigandBDBM24656
Substrate/CompetitorBDBM10852
Meas. Tech.Ligand Binding Assay
pH7.5±n/a
Temperature310.15±n/a K
Kd 1300000±n/a nM
Citation Podust, LMvon Kries, JPEddine, ANKim, YYermalitskaya, LVKuehne, ROuellet, HWarrier, TAlteköster, MLee, JSRademann, JOschkinat, HKaufmann, SHWaterman, MR Small-molecule scaffolds for CYP51 inhibitors identified by high-throughput screening and defined by X-ray crystallography. Antimicrob Agents Chemother51:3915-23 (2007) 
 
Lanosterol 14-alpha demethylase
Name:Lanosterol 14-alpha demethylase
Type:Monooxygenase; oxidoreductase
Mol. Mass.:50869.67
Organism:Mycobacterium tuberculosis (strain CDC 1551 / Oshkosh)
Description:P9WPP8
Residue:451
BDBM24656
BDBM10852
NameBDBM24656
Synonyms:4-PIM 4-phenyl-1H-imidazole CHEMBL14145 US9144538, 4-Phenylimidazole
TypeSmall organic molecule
Emp. Form.C9H8N2
Mol. Mass.144.1732
SMILESc1nc(c[nH]1)-c1ccccc1