Reaction Details
TargetLanosterol 14-alpha demethylase
LigandBDBM25813
Substrate/CompetitorBDBM10852
Meas. Tech.Ligand Binding Assay
pH7.5±n/a
Temperature310.15±n/a K
Kd 7500±n/a nM
CommentsKd from 5 to 10 uM.
Citation Podust, LMvon Kries, JPEddine, ANKim, YYermalitskaya, LVKuehne, ROuellet, HWarrier, TAlteköster, MLee, JSRademann, JOschkinat, HKaufmann, SHWaterman, MR Small-molecule scaffolds for CYP51 inhibitors identified by high-throughput screening and defined by X-ray crystallography. Antimicrob Agents Chemother51:3915-23 (2007) 
 
Lanosterol 14-alpha demethylase
Name:Lanosterol 14-alpha demethylase
Type:Monooxygenase; oxidoreductase
Mol. Mass.:50869.67
Organism:Mycobacterium tuberculosis (strain CDC 1551 / Oshkosh)
Description:P9WPP8
Residue:451
BDBM25813
BDBM10852
NameBDBM25813
Synonyms:1-(10,10a-dihydro-4aH-phenothiazin-10-yl)-2-aminoethan-1-one Compound 2529-0078
TypeSmall organic molecule
Emp. Form.C14H14N2OS
Mol. Mass.258.339
SMILESNCC(=O)N1C2C=CC=CC2Sc2ccccc12