Reaction Details
TargetTyrosine-protein kinase TXK
LigandBDBM384544
Substrate/Competitorn/a
Meas. Tech.Enzymatic Activity In Vitro Assays
IC50 1.20±n/a nM
Citation Owens, THill, RJ Benzimidazole derivatives as RLK and ITK inhibitors US Patent US9932329 Publication Date 4/3/2018
 
Tyrosine-protein kinase TXK
Name:Tyrosine-protein kinase TXK
Type:Protein
Mol. Mass.:61268.80
Organism:Homo sapiens (Human)
Description:P42681
Residue:527
BDBM384544
NameBDBM384544
Synonyms:N-(1-(((R)-1-(2-cyano-4,4-dimethylpent-2-enoyl)pyrrolidin-2-yl)methyl)-5-((((S)-3,3-dimethyl-butan-2-yl)amino)methyl)-1H-benzo[d]imidazol-2-yl)-5-(oxazol-5-yl)thiophene-2-carboxamide | US9932329, Cpd # 15
TypeSmall organic molecule
Emp. Form.C35H43N7O3S
Mol. Mass.641.826
SMILESC[C@H](NCc1ccc2n(C[C@H]3CCCN3C(=O)C(=CC(C)(C)C)C#N)c(NC(=O)c3ccc(s3)-c3cnco3)nc2c1)C(C)(C)C