Reaction Details
TargetMitogen-activated protein kinase 10
LigandBDBM25979
Substrate/CompetitorBDBM25978
Meas. Tech.Fluorescence Polarization Assay
pH7.5±n/a
Temperature295.15±n/a K
Ki>4000±n/a nM
IC50>16000±n/a nM
Citation Angell, RMBamborough, PCleasby, ACockerill, SGJones, KLMooney, CJSomers, DOWalker, AL Biphenyl amide p38 kinase inhibitors 1: Discovery and binding mode. Bioorg Med Chem Lett18:318-23 (2008) 
 
Mitogen-activated protein kinase 10
Name:Mitogen-activated protein kinase 10
Type:Enzyme
Mol. Mass.:52586.89
Organism:Homo sapiens (Human)
Description:n/a
Residue:464
BDBM25979
BDBM25978
NameBDBM25979
Synonyms:BMCL18324 Compound 1 biphenyl amide, 2
TypeSmall organic molecule
Emp. Form.C29H31N5O3
Mol. Mass.497.5881
SMILESCOc1ccc(NC(=O)c2ccc(cc2)-c2cc(ccc2C)-c2nnc(C)o2)cc1N1CCN(C)CC1