Reaction Details
TargetMitogen-activated protein kinase 14
LigandBDBM25989
Substrate/CompetitorBDBM25978
Meas. Tech.Fluorescence Polarization Assay
pH7.5±n/a
Temperature295.15±n/a K
Ki 60±n/a nM
IC50 370±n/a nM
Citation Angell, RMAngell, TDBamborough, PBrown, DBrown, MBuckton, JBCockerill, SGEdwards, CDJones, KLLongstaff, TSmee, PASmith, KJSomers, DOWalker, ALWillson, M Biphenyl amide p38 kinase inhibitors 2: Optimisation and SAR. Bioorg Med Chem Lett18:324-8 (2008) 
 
Mitogen-activated protein kinase 14
Name:Mitogen-activated protein kinase 14
Type:Serine/threonine-protein kinase
Mol. Mass.:41286.76
Organism:Homo sapiens (Human)
Description:Q16539
Residue:360
BDBM25989
BDBM25978
NameBDBM25989
Synonyms:N-[(3-methoxyphenyl)methyl]-4-[2-methyl-5-(5-methyl-1,3,4-oxadiazol-2-yl)phenyl]benzamide | benzyl amide analog., 10
TypeSmall organic molecule
Emp. Form.C25H23N3O3
Mol. Mass.413.4684
SMILESCOc1cccc(CNC(=O)c2ccc(cc2)-c2cc(ccc2C)-c2nnc(C)o2)c1