Reaction Details
TargetMitogen-activated protein kinase 14
LigandBDBM25991
Substrate/CompetitorBDBM25978
Meas. Tech.Fluorescence Polarization Assay
pH7.5±n/a
Temperature295.15±n/a K
Ki 100±n/a nM
IC50 600±n/a nM
Citation Angell, RMAngell, TDBamborough, PBrown, DBrown, MBuckton, JBCockerill, SGEdwards, CDJones, KLLongstaff, TSmee, PASmith, KJSomers, DOWalker, ALWillson, M Biphenyl amide p38 kinase inhibitors 2: Optimisation and SAR. Bioorg Med Chem Lett18:324-8 (2008) 
 
Mitogen-activated protein kinase 14
Name:Mitogen-activated protein kinase 14
Type:Serine/threonine-protein kinase
Mol. Mass.:41286.76
Organism:Homo sapiens (Human)
Description:Q16539
Residue:360
BDBM25991
BDBM25978
NameBDBM25991
Synonyms:N-[(4-chlorophenyl)methyl]-4-[2-methyl-5-(5-methyl-1,3,4-oxadiazol-2-yl)phenyl]benzamide | benzyl amide analog., 12
TypeSmall organic molecule
Emp. Form.C24H20ClN3O2
Mol. Mass.417.888
SMILESCc1nnc(o1)-c1ccc(C)c(c1)-c1ccc(cc1)C(=O)NCc1ccc(Cl)cc1